2019/01/05(土)dovecot 2.3.4 はコンパイルエラーになる

2019/01/05 3:09 サーバ運営・管理
FreeBSD 11.2 または 12.0 にて、dovecot をソースコードから構築しようとすると、
途中で下記のようなエラーが出て、構築が出来なくなります:
test-event-stats.c: In function 'kill_stats_child':
test-event-stats.c:101:2: warning: implicit declaration of function 'kill'
[-Wimplicit-function-declaration]
(void)kill(stats_pid, SIGKILL);
^
test-event-stats.c:101:24: error: 'SIGKILL' undeclared (first use in this
function)
(void)kill(stats_pid, SIGKILL);
^
test-event-stats.c:101:24: note: each undeclared identifier is reported
only once for each function it appears in
gmake[2]: *** [Makefile:656: test-event-stats.o] Error 1
gmake[2]: Leaving directory
'/usr/local/src/dovecot-2.3.4/src/lib-master'
gmake[1]: *** [Makefile:565: install-recursive] Error 1
gmake[1]: Leaving directory
'/usr/local/src/dovecot-2.3.4/src'
gmake: *** [Makefile:683: install-recursive] Error 1
どうやら調査すると、構築環境依存による(?)バグらしく、パッチが出ていました:
https://github.com/dovecot/core/compare/10048229%5E...de42b54a.patch

このパッチでコンパイル自体は通りますが、実際の運用で問題ないかどうかまでは判りません。
dovecot 2.3.3 で特段問題が出ていない場合、2.3.4 へのアップデートは見合わせたほうがいいかもしれません。
OK キャンセル 確認 その他